Login to Your Account
Results 1 to 1 of 1
  1. #1
    Join Date
    Oct 2019

    skr 1.3 + TMC2208 on my ender 3

    Im trying to flash my new skr 1.3 but got problems to upload the marlin software

    full log
    > Executing task: C:\Users\Piotr\.platformio\penv\Scripts\platformio.exe run --target upload <
    Processing LPC1768 (platform:; board: nxp_lpc1768; framework: arduino)
    Verbose mode can be enabled via `-v, --verbose` option
    PLATFORM: NXP Arduino LPC176x 0.1.1 > NXP LPC1768
    HARDWARE: LPC1768 100MHz, 31.97KB RAM, 464KB Flash
    DEBUG: Current (cmsis-dap) On-board (cmsis-dap) External (blackmagic, jlink)
    PACKAGES: toolchain-gccarmnoneeabi 1.80201.190214 (8.2.1), framework-arduino-lpc176x 0.2.2
    Converting Marlin.ino
    LDF: Library Dependency Finder ->
    LDF Modes: Finder ~ off, Compatibility ~ strict
    Found 6 compatible libraries
    Scanning dependencies...
    Dependency Graph
    |-- <Servo> 1.0.0
    |-- <LiquidCrystal> 1.0.0
    |-- <U8glib-HAL> 0.4.1
    |-- <TMCStepper> 0.6.1
    |-- <Adafruit NeoPixel> 1.3.0
    |-- <SailfishLCD>
    Building in release mode
    Unable to find destination disk (Command 'fsutil fsinfo drives' returned non-zero exit status 1.)
    Please select it in platformio.ini using the upload_port keyword ( or copy the firmware (.pio/build/LPC1768/firmware.bin) manually to the appropriate disk
    Checking size .pio\build\LPC1768\firmware.elf
    Advanced Memory Usage is available via "PlatformIO Home > Project Inspect"
    DATA:    [====      ]  42.2% (used 13800 bytes from 32736 bytes)
    PROGRAM: [===       ]  33.5% (used 159052 bytes from 475136 bytes)
    Configuring upload protocol...
    AVAILABLE: blackmagic, cmsis-dap, jlink, mbed
    CURRENT: upload_protocol = mbed
    Looking for upload disk...
    Error: Please specify `upload_port` for environment or use global `--upload-port` option.
    For some development platforms it can be a USB flash drive (i.e. /media/<user>/<device name>)
    *** [upload] Explicit exit, status 1
    ============================================== [FAILED] Took 7.51 seconds ==============================================
    Environment                   Status    Duration
    ----------------------------  --------  ------------
    megaatmega2560                IGNORED
    megaatmega1280                IGNORED
    rambo                         IGNORED
    FYSETC_F6_13                  IGNORED
    sanguino_atmega644p           IGNORED
    sanguino_atmega1284p          IGNORED
    melzi                         IGNORED
    melzi_optiboot                IGNORED
    at90usb1286_cdc               IGNORED
    at90usb1286_dfu               IGNORED
    DUE                           IGNORED
    DUE_USB                       IGNORED
    DUE_debug                     IGNORED
    LPC1768                       FAILED    00:00:07.505
    LPC1769                       IGNORED
    STM32F103RC                   IGNORED
    STM32F103RC_fysetc            IGNORED
    STM32F103RC_bigtree           IGNORED
    STM32F103RC_bigtree_USB       IGNORED
    STM32F103RC_bigtree_512K      IGNORED
    STM32F103RC_bigtree_512K_USB  IGNORED
    STM32F103RE                   IGNORED
    STM32F103RE_bigtree           IGNORED
    STM32F103RE_bigtree_USB       IGNORED
    STM32F4                       IGNORED
    STM32F7                       IGNORED
    ARMED                         IGNORED
    STM32F103VE_longer            IGNORED
    mks_robin                     IGNORED
    mks_robin_lite                IGNORED
    mks_robin_mini                IGNORED
    mks_robin_nano                IGNORED
    jgaurora_a5s_a1               IGNORED
    STM32F103CB_malyan            IGNORED
    chitu_f103                    IGNORED
    FYSETC_S6                     IGNORED
    STM32F407VE_black             IGNORED
    BIGTREE_SKR_PRO               IGNORED
    BIGTREE_BTT002                IGNORED
    teensy31                      IGNORED
    teensy35                      IGNORED
    esp32                         IGNORED
    linux_native                  IGNORED
    SAMD51_grandcentral_m4        IGNORED
    include_tree                  IGNORED
    ========================================= 1 failed, 0 succeeded in 00:00:07.505 =========================================
    The terminal process terminated with exit code: 1
    Terminal will be reused by tasks, press any key to close it.
    I'm really struggling with this crapy board. Regretting that I bought it. Any ideas what may be wrong?
    Got installed GitHub as well.

Thread Information

Users Browsing this Thread

There are currently 1 users browsing this thread. (0 members and 1 guests)

Similar Threads

  1. DISCUSSION Printing with ABS on an Ender 3 Pro, warping ...looking for help
    By Cavscout in forum Beginners (New to 3D Printing)
    Replies: 0
    Last Post: 10-14-2019, 11:10 AM
  2. Ender 3 with MKS Gen L with TMC2208 drivers
    By redbeard in forum Hardware (stepper motor, drivers Etc)
    Replies: 0
    Last Post: 05-06-2019, 10:44 PM
  3. DISCUSSION help end of filament on creality ender 3.
    By didiersee in forum Beginners (New to 3D Printing)
    Replies: 0
    Last Post: 02-03-2019, 11:34 AM
  4. NEED HELP creality ender 3 - what am i doing wrong ? Slighly failed prints
    By reszkov in forum Beginners (New to 3D Printing)
    Replies: 1
    Last Post: 02-03-2019, 03:09 AM
  5. NEED HELP problem building creality ender 3
    By Cubsterky in forum Beginners (New to 3D Printing)
    Replies: 0
    Last Post: 01-29-2019, 09:22 PM

Tags for this Thread


Posting Permissions

  • You may not post new threads
  • You may not post replies
  • You may not post attachments
  • You may not edit your posts